Building
type: Class
subclass of: Thing

TemperatureSensor
type: Class
comment: A device that consists of a sensor, has category `saref:Sensor` and is used for the purpose of sensing temperature`.
subclass of: Thing

FillingLevelSensor
type: Class
comment: A device that consists of a sensor, has category `saref:Sensor` and is used for the purpose of sensing filling Level.
subclass of: Thing

Person
type: Class
subclass of: Thing

temperature
type: Property
comment: Property related to some measurements that are characterized by a certain value that is measured in a temperature unit (degree_Celsius, degree_Fahrenheit, or degree_kelvin)

fillingLevel
type: Property
comment: Property related to some measurements that are characterized by a certain value that is a filling level.